{"text_format":"1","workbook":"xlsx","n_sheets":7,"sheets":["classement","Poussins JP R2","Poussins JP R3","Poussins JP R 1","Challenge ","total ","juges"],"not_rendered":{"charts":0,"images":1,"macros":1,"external_links":0,"defined_names":2,"comments":0,"pivot_tables":0},"unopened":[],"bounds":{"document_bytes":16777216,"sheet_cells":100000,"rows_first":2000,"rows_last":500,"rows_between":2000,"halvings":0,"cell_chars":16384,"cell_head_chars":4096},"cells_cut":0,"cells_raw":0,"read":"whole","date_system":"1900"}

{"sheet":"classement","index":0,"n_rows":41,"n_cols":4,"rows_kept":41,"cut":false,"hidden":false,"merged":[[10,5,10,7]]}
[]
[null,null,"MOUVAUX le 1° Juin 2025"]
[]
[null,"CLASSEMENT REGIONAL POUSSINS 2025"]
[]
[]
[]
[]
[]
[]
[null,"CLUB","VILLE","TOTAL"]
[null,"POUSSINS JP R 2"]
[{"$f":"'Poussins JP R2'!A2","v":1},{"$f":"'Poussins JP R2'!B32","v":"LA JEANNE ARC "},{"$f":"'Poussins JP R2'!C32","v":"FOURNES "},{"$f":"'Poussins JP R2'!AA45","v":379.2}]
[{"$f":"'Poussins JP R2'!A17","v":2},{"$f":"'Poussins JP R2'!B2","v":"LA LORRAINE "},{"$f":"'Poussins JP R2'!C2","v":"RACHES "},{"$f":"'Poussins JP R2'!AA15","v":365.2}]
[{"$f":"'Poussins JP R2'!A32","v":3},{"$f":"'Poussins JP R2'!B17","v":"L'AMANDINOISE "},{"$f":"'Poussins JP R2'!C17","v":"ST AMAND "},{"$f":"'Poussins JP R2'!AA30","v":353.85}]
{"$rows_left_out":27}
{"sheet":"Poussins JP R2","index":1,"n_rows":112,"n_cols":27,"rows_kept":112,"cut":false,"hidden":false,"merged":[]}
[]
[1,"LA LORRAINE ","RACHES "]
[]
[null,"Nom ","Prénom","Degré ","Note ",null,"Sol ","Degré ","Note ",null,"Saut ","Degré ","Note ",null,"BP ","Degré ","Note ",null,"BF","Note ",null,"Arçons","Note ",null,"AN ","Total; des 6 Meilleurs notes "]
[null,null,null,1,7.75,{"$f":"IF(OR(E5<7,NOT(ISNUMBER(D5))),\"\",IF(D5=0,\"\",CHOOSE(D5,1,2,3,4,5)))","v":1},{"$f":"SUM(E5:F5)","v":8.75},2,8.25,{"$f":"IF(OR(I5<7,NOT(ISNUMBER(H5))),\"\",IF(H5=0,\"\",CHOOSE(H5,1,2,3,4,5)))","v":2},{"$f":"SUM(I5:J5)","v":10.25},1,7.25,{"$f":"IF(OR(M5<7,NOT(ISNUMBER(L5))),\"\",IF(L5=0,\"\",CHOOSE(L5,1,2,3,4,5)))","v":1},{"$f":"SUM(M5:N5)","v":8.25},2,7.65,{"$f":"IF(OR(Q5<7,NOT(ISNUMBER(P5))),\"\",IF(P5=0,\"\",CHOOSE(P5,1,2,3,4,5)))","v":2},{"$f":"SUM(Q5:R5)","v":9.65},3.05,0,{"$f":"SUM(T5:U5)","v":3.05},1,{"$f":"IF(OR(W5<7,NOT(ISNUMBER(#REF!))),\"\",IF(#REF!=0,\"\",CHOOSE(#REF!,1,2,3,4,5)))","v":""},{"$f":"SUM(W5:X5)","v":1}]
[null,null,null,4,8.15,{"$f":"IF(OR(E6<7,NOT(ISNUMBER(D6))),\"\",IF(D6=0,\"\",CHOOSE(D6,1,2,3,4,5)))","v":4},{"$f":"SUM(E6:F6)","v":12.15},4,7.7,4,{"$f":"SUM(I6:J6)","v":11.7},3,8.5,{"$f":"IF(OR(M6<7,NOT(ISNUMBER(L6))),\"\",IF(L6=0,\"\",CHOOSE(L6,1,2,3,4,5)))","v":3},{"$f":"SUM(M6:N6)","v":11.5},3,8.5500000000000007,{"$f":"IF(OR(Q6<7,NOT(ISNUMBER(P6))),\"\",IF(P6=0,\"\",CHOOSE(P6,1,2,3,4,5)))","v":3},{"$f":"SUM(Q6:R6)","v":11.55},5.15,0,{"$f":"SUM(T6:U6)","v":5.15},8.3000000000000007,{"$f":"IF(OR(W6<7,NOT(ISNUMBER(#REF!))),\"\",IF(#REF!=0,\"\",CHOOSE(#REF!,1,2,3,4,5)))","v":""},{"$f":"SUM(W6:X6)","v":8.3000000000000007},"Sol",{"$f":"LARGE(G5:G14,1)+LARGE(G5:G14,2)+LARGE(G5:G14,3)+LARGE(G5:G14,4)+LARGE(G5:G14,5)+LARGE(G5:G14,6)","v":71.25}]
[null,null,null,3,8.4499999999999993,3,11.45,3,9.1,3,12.1,3,9.5,3,12.5,3,8.9,3,11.9,6.15,0,6.15,7.9,{"$f":"IF(OR(W7<7,NOT(ISNUMBER(#REF!))),\"\",IF(#REF!=0,\"\",CHOOSE(#REF!,1,2,3,4,5)))","v":""},7.9,"Saut ",{"$f":"LARGE(K5:K14,1)+LARGE(K5:K14,2)+LARGE(K5:K14,3)+LARGE(K5:K14,4)+LARGE(K5:K14,5)+LARGE(K5:K14,6)","v":74.149999999999991}]
[null,null,null,4,8.15,4,12.15,2,8.25,2,10.25,4,8.5,4,12.5,3,8.9499999999999993,3,11.95,6.9,0,6.9,8.0500000000000007,{"$f":"IF(OR(W8<7,NOT(ISNUMBER(#REF!))),\"\",IF(#REF!=0,\"\",CHOOSE(#REF!,1,2,3,4,5)))","v":""},8.0500000000000007,"BP ",{"$f":"LARGE(O5:O14,1)+LARGE(O5:O14,2)+LARGE(O5:O14,3)+LARGE(O5:O14,4)+LARGE(O5:O14,5)+LARGE(O5:O14,6)","v":69.5}]
[null,null,null,1,8.5,1,9.5,3,9.3000000000000007,3,12.3,2,7.6,2,9.6,2,7.9,2,9.9,3.8,0,3.8,3.2,{"$f":"IF(OR(W9<7,NOT(ISNUMBER(#REF!))),\"\",IF(#REF!=0,\"\",CHOOSE(#REF!,1,2,3,4,5)))","v":""},3.2,"BF",{"$f":"LARGE(S5:S14,1)+LARGE(S5:S14,2)+LARGE(S5:S14,3)+LARGE(S5:S14,4)+LARGE(S5:S14,5)+LARGE(S5:S14,6)","v":68.55}]
[null,null,null,4,8.75,4,12.75,3,9.25,3,12.25,3,7.4,3,10.4,3,8.9499999999999993,3,11.95,5.85,0,5.85,8.6999999999999993,null,8.6999999999999993,"Arcons",{"$f":"LARGE(V5:V14,1)+LARGE(V5:V14,2)+LARGE(V5:V14,3)+LARGE(V5:V14,4)+LARGE(V5:V14,5)+LARGE(V5:V14,6)","v":32.799999999999997}]
[null,null,null,3,8.5500000000000007,3,11.55,4,9.1999999999999993,4,13.2,3,8.9,3,11.9,3,7.15,3,10.15,4.95,0,4.95,7.9,null,7.9,"Anneaux",{"$f":"LARGE(Y5:Y14,1)+LARGE(Y5:Y14,2)+LARGE(Y5:Y14,3)+LARGE(Y5:Y14,4)+LARGE(Y5:Y14,5)+LARGE(Y5:Y14,6)","v":48.95}]
[null,null,null,3,8.1999999999999993,3,11.2,3,9.6,3,12.6,3,7.7,3,10.7,3,8.0500000000000007,3,11.05,3.5,0,3.5,8.1,null,8.1]
[null,null,null,null,null,"",0,null,null,"",0,null,null,"",0,null,null,"",0,null,0,0,null,null,0]
[null,null,null,null,null,{"$f":"IF(OR(E14<7,NOT(ISNUMBER(D14))),\"\",IF(D14=0,\"\",CHOOSE(D14,1,2,3,4,5)))","v":""},null,null,null,"",null,null,null,{"$f":"IF(OR(M14<7,NOT(ISNUMBER(L14))),\"\",IF(L14=0,\"\",CHOOSE(L14,1,2,3,4,5)))","v":""},null,null,null,"",null,null,{"$f":"IF(OR(T14<7,NOT(ISNUMBER(#REF!))),\"\",IF(#REF!=0,\"\",CHOOSE(#REF!,1,2,3,4,5)))","v":""},null,null,{"$f":"IF(OR(W14<7,NOT(ISNUMBER(#REF!))),\"\",IF(#REF!=0,\"\",CHOOSE(#REF!,1,2,3,4,5)))","v":""}]
[null,null,"Total",null,null,null,{"$f":"SUM(G5:G14)","v":89.5},null,null,null,{"$f":"SUM(K5:K14)","v":94.649999999999991},null,null,null,{"$f":"SUM(O5:O14)","v":87.350000000000009},null,null,null,{"$f":"SUM(S5:S14)","v":88.1},null,null,{"$f":"SUM(V5:V14)","v":39.35},null,null,{"$f":"SUM(Y5:Y14)","v":53.150000000000006},"Total Gal ",{"$f":"SUM(AA5:AA14)","v":365.2}]
{"$rows_left_out":98}
{"sheet":"Poussins JP R3","index":2,"n_rows":159,"n_cols":27,"rows_kept":159,"cut":false,"hidden":false,"merged":[]}
[1,"L'USSA ","ST ANDRE "]
[]
[null,"Nom ","Prénom","Degré ","Note ",null,"Sol ","Degré ","Note ",null,"Saut ","Degré ","Note ",null,"BP ","Degré ","Note ",null,"BF","Note ",null,"Arçons","Note ",null,"AN ","Total; des 3 Meilleurs notes "]
[null,null,null,4,8.1,{"$f":"IF(OR(E4<7,NOT(ISNUMBER(D4))),\"\",IF(D4=0,\"\",CHOOSE(D4,1,2,3,4,5)))","v":4},{"$f":"SUM(E4:F4)","v":12.1},3,9,{"$f":"IF(OR(I4<7,NOT(ISNUMBER(H4))),\"\",IF(H4=0,\"\",CHOOSE(H4,1,2,3,4,5)))","v":3},{"$f":"SUM(I4:J4)","v":12},3,9.15,{"$f":"IF(OR(M4<7,NOT(ISNUMBER(L4))),\"\",IF(L4=0,\"\",CHOOSE(L4,1,2,3,4,5)))","v":3},{"$f":"SUM(M4:N4)","v":12.15},3,8.65,{"$f":"IF(OR(Q4<7,NOT(ISNUMBER(P4))),\"\",IF(P4=0,\"\",CHOOSE(P4,1,2,3,4,5)))","v":3},{"$f":"SUM(Q4:R4)","v":11.65},5.25,{"$f":"IF(OR(T4<7,NOT(ISNUMBER(#REF!))),\"\",IF(#REF!=0,\"\",CHOOSE(#REF!,1,2,3,4,5)))","v":""},{"$f":"SUM(T4:U4)","v":5.25},8.4,{"$f":"IF(OR(W4<7,NOT(ISNUMBER(#REF!))),\"\",IF(#REF!=0,\"\",CHOOSE(#REF!,1,2,3,4,5)))","v":""},{"$f":"SUM(W4:X4)","v":8.4}]
[null,null,null,2,8.15,{"$f":"IF(OR(E5<7,NOT(ISNUMBER(D5))),\"\",IF(D5=0,\"\",CHOOSE(D5,1,2,3,4,5)))","v":2},{"$f":"SUM(E5:F5)","v":10.15},3,8.4499999999999993,3,11.45,3,8,{"$f":"IF(OR(M5<7,NOT(ISNUMBER(L5))),\"\",IF(L5=0,\"\",CHOOSE(L5,1,2,3,4,5)))","v":3},{"$f":"SUM(M5:N5)","v":11},2,8.8000000000000007,{"$f":"IF(OR(Q5<7,NOT(ISNUMBER(P5))),\"\",IF(P5=0,\"\",CHOOSE(P5,1,2,3,4,5)))","v":2},{"$f":"SUM(Q5:R5)","v":10.8},3,{"$f":"IF(OR(T5<7,NOT(ISNUMBER(#REF!))),\"\",IF(#REF!=0,\"\",CHOOSE(#REF!,1,2,3,4,5)))","v":""},{"$f":"SUM(T5:U5)","v":3},7.7,{"$f":"IF(OR(W5<7,NOT(ISNUMBER(#REF!))),\"\",IF(#REF!=0,\"\",CHOOSE(#REF!,1,2,3,4,5)))","v":""},{"$f":"SUM(W5:X5)","v":7.7},"Sol",{"$f":"LARGE(G4:G10,1)+LARGE(G4:G10,2)+LARGE(G4:G10,3)","v":32.449999999999996}]
[null,null,null,2,7.65,2,9.65,2,8.5,2,10.5,2,7.9,2,9.9,2,6.25,"",6.25,3.3,{"$f":"IF(OR(T6<7,NOT(ISNUMBER(#REF!))),\"\",IF(#REF!=0,\"\",CHOOSE(#REF!,1,2,3,4,5)))","v":""},3.3,1,{"$f":"IF(OR(W6<7,NOT(ISNUMBER(#REF!))),\"\",IF(#REF!=0,\"\",CHOOSE(#REF!,1,2,3,4,5)))","v":""},1,"Saut ",{"$f":"LARGE(K4:K10,1)+LARGE(K4:K10,2)+LARGE(K4:K10,3)","v":34.65}]
[null,null,null,2,7.8,2,9.8000000000000007,2,8.5500000000000007,2,10.55,2,8.85,2,10.85,2,7.55,2,9.5500000000000007,3.7,{"$f":"IF(OR(T7<7,NOT(ISNUMBER(#REF!))),\"\",IF(#REF!=0,\"\",CHOOSE(#REF!,1,2,3,4,5)))","v":""},3.7,7.5,{"$f":"IF(OR(W7<7,NOT(ISNUMBER(#REF!))),\"\",IF(#REF!=0,\"\",CHOOSE(#REF!,1,2,3,4,5)))","v":""},7.5,"BP ",{"$f":"LARGE(O4:O10,1)+LARGE(O4:O10,2)+LARGE(O4:O10,3)","v":34}]
[null,null,null,3,7.2,3,10.199999999999999,3,8.1999999999999993,3,11.2,3,6.55,"",6.55,2,8,2,10,3,{"$f":"IF(OR(T8<7,NOT(ISNUMBER(#REF!))),\"\",IF(#REF!=0,\"\",CHOOSE(#REF!,1,2,3,4,5)))","v":""},3,7.7,{"$f":"IF(OR(W8<7,NOT(ISNUMBER(#REF!))),\"\",IF(#REF!=0,\"\",CHOOSE(#REF!,1,2,3,4,5)))","v":""},7.7,"BF",{"$f":"LARGE(S4:S10,1)+LARGE(S4:S10,2)+LARGE(S4:S10,3)","v":32.450000000000003}]
[null,null,null,null,null,"",0,null,null,"",0,null,null,"",0,null,null,"",0,null,{"$f":"IF(OR(T9<7,NOT(ISNUMBER(#REF!))),\"\",IF(#REF!=0,\"\",CHOOSE(#REF!,1,2,3,4,5)))","v":""},0,null,{"$f":"IF(OR(W9<7,NOT(ISNUMBER(#REF!))),\"\",IF(#REF!=0,\"\",CHOOSE(#REF!,1,2,3,4,5)))","v":""},0,"Arçons ",{"$f":"LARGE(V4:V10,1)+LARGE(V4:V10,2)+LARGE(V4:V10,3)","v":12.25}]
[null,null,null,null,null,"",null,null,null,"",null,null,null,"",null,null,null,"",null,null,{"$f":"IF(OR(T10<7,NOT(ISNUMBER(#REF!))),\"\",IF(#REF!=0,\"\",CHOOSE(#REF!,1,2,3,4,5)))","v":""},null,null,{"$f":"IF(OR(W10<7,NOT(ISNUMBER(#REF!))),\"\",IF(#REF!=0,\"\",CHOOSE(#REF!,1,2,3,4,5)))","v":""},null,"Anneaux",{"$f":"LARGE(Y4:Y10,1)+LARGE(Y4:Y10,2)+LARGE(Y4:Y10,3)","v":23.8}]
[null,null,"Total",null,null,null,{"$f":"SUM(G4:G10)","v":51.900000000000006},null,null,null,{"$f":"SUM(K4:K10)","v":55.7},null,null,null,{"$f":"SUM(O4:O10)","v":50.449999999999996},null,null,null,{"$f":"SUM(S4:S10)","v":48.25},null,null,{"$f":"SUM(V4:V10)","v":18.25},null,null,{"$f":"SUM(Y4:Y10)","v":32.300000000000004},"Total Gal ",{"$f":"SUM(AA4:AA10)","v":169.60000000000002}]
[]
[2,"LA JEANNE ARC ","ESTAIRES "]
[]
[null,"Nom ","Prénom","Degré ","Note ",null,"Sol ","Degré ","Note ",null,"Saut ","Degré ","Note ",null,"BP ","Degré ","Note ",null,"BF","Note ",null,"Arçons","Note ",null,"AN ","Total; des 3 Meilleurs notes "]
{"$rows_left_out":145}
{"sheet":"Poussins JP R 1","index":3,"n_rows":79,"n_cols":27,"rows_kept":79,"cut":false,"hidden":false,"merged":[]}
[]
[]
[]
[1,"JEANNE ARC ","MOUVAUX "]
[]
[null,"Nom ","Prénom","Degré ","Note ",null,"Sol ","Degré ","Note ",null,"Saut ","Degré ","Note ",null,"BP ","Degré ","Note ",null,"BF","Note ",null,"Arçons","Note ",null,"AN ","Total; des 10 Meilleurs notes "]
[1,null,null,4,8.9499999999999993,{"$f":"IF(OR(E7<7,NOT(ISNUMBER(D7))),\"\",IF(D7=0,\"\",CHOOSE(D7,1,2,3,4,5)))","v":4},{"$f":"SUM(E7:F7)","v":12.95},4,8.75,{"$f":"IF(OR(I7<7,NOT(ISNUMBER(H7))),\"\",IF(H7=0,\"\",CHOOSE(H7,1,2,3,4,5)))","v":4},{"$f":"SUM(I7:J7)","v":12.75},3,8.4,{"$f":"IF(OR(M7<7,NOT(ISNUMBER(L7))),\"\",IF(L7=0,\"\",CHOOSE(L7,1,2,3,4,5)))","v":3},{"$f":"SUM(M7:N7)","v":11.4},4,8.25,{"$f":"IF(OR(Q7<7,NOT(ISNUMBER(P7))),\"\",IF(P7=0,\"\",CHOOSE(P7,1,2,3,4,5)))","v":4},{"$f":"SUM(Q7:R7)","v":12.25},6.45,{"$f":"IF(OR(T7<7,NOT(ISNUMBER(#REF!))),\"\",IF(#REF!=0,\"\",CHOOSE(#REF!,1,2,3,4,5)))","v":""},{"$f":"SUM(T7:U7)","v":6.45},8.25,{"$f":"IF(OR(W7<7,NOT(ISNUMBER(#REF!))),\"\",IF(#REF!=0,\"\",CHOOSE(#REF!,1,2,3,4,5)))","v":""},{"$f":"SUM(W7:X7)","v":8.25}]
[2,null,null,3,8.6999999999999993,{"$f":"IF(OR(E8<7,NOT(ISNUMBER(D8))),\"\",IF(D8=0,\"\",CHOOSE(D8,1,2,3,4,5)))","v":3},{"$f":"SUM(E8:F8)","v":11.7},3,9.4,{"$f":"IF(OR(I8<7,NOT(ISNUMBER(H8))),\"\",IF(H8=0,\"\",CHOOSE(H8,1,2,3,4,5)))","v":3},{"$f":"SUM(I8:J8)","v":12.4},2,9.4,{"$f":"IF(OR(M8<7,NOT(ISNUMBER(L8))),\"\",IF(L8=0,\"\",CHOOSE(L8,1,2,3,4,5)))","v":2},{"$f":"SUM(M8:N8)","v":11.4},3,8.4499999999999993,{"$f":"IF(OR(Q8<7,NOT(ISNUMBER(P8))),\"\",IF(P8=0,\"\",CHOOSE(P8,1,2,3,4,5)))","v":3},{"$f":"SUM(Q8:R8)","v":11.45},6.1,{"$f":"IF(OR(T8<7,NOT(ISNUMBER(#REF!))),\"\",IF(#REF!=0,\"\",CHOOSE(#REF!,1,2,3,4,5)))","v":""},{"$f":"SUM(T8:U8)","v":6.1},5.3,{"$f":"IF(OR(W8<7,NOT(ISNUMBER(#REF!))),\"\",IF(#REF!=0,\"\",CHOOSE(#REF!,1,2,3,4,5)))","v":""},{"$f":"SUM(W8:X8)","v":5.3},"Sol",{"$f":"LARGE(G7:G24,1)+LARGE(G7:G24,2)+LARGE(G7:G24,3)+LARGE(G7:G24,4)+LARGE(G7:G24,5)+LARGE(G7:G24,6)+LARGE(G7:G24,7)+LARGE(G7:G24,8)+LARGE(G7:G24,9)+LARGE(G7:G24,10)","v":112.10000000000001}]
[3,null,null,3,7.5,3,10.5,3,5,"",5,2,9.5,2,11.5,2,9.3000000000000007,2,11.3,4.95,{"$f":"IF(OR(T9<7,NOT(ISNUMBER(#REF!))),\"\",IF(#REF!=0,\"\",CHOOSE(#REF!,1,2,3,4,5)))","v":""},4.95,6.8,{"$f":"IF(OR(W9<7,NOT(ISNUMBER(#REF!))),\"\",IF(#REF!=0,\"\",CHOOSE(#REF!,1,2,3,4,5)))","v":""},6.8,"Saut ",{"$f":"LARGE(K7:K24,1)+LARGE(K7:K24,2)+LARGE(K7:K24,3)+LARGE(K7:K24,4)+LARGE(K7:K24,5)+LARGE(K7:K24,6)+LARGE(K7:K24,7)+LARGE(K7:K24,8)+LARGE(K7:K24,9)+LARGE(K7:K24,10)","v":113.10000000000001}]
[4,null,null,1,7.5,1,8.5,2,8.9,2,10.9,2,7.75,2,9.75,2,8.1,2,10.1,3.4,{"$f":"IF(OR(T10<7,NOT(ISNUMBER(#REF!))),\"\",IF(#REF!=0,\"\",CHOOSE(#REF!,1,2,3,4,5)))","v":""},3.4,8.9,{"$f":"IF(OR(W10<7,NOT(ISNUMBER(#REF!))),\"\",IF(#REF!=0,\"\",CHOOSE(#REF!,1,2,3,4,5)))","v":""},8.9,"BP ",{"$f":"LARGE(O7:O24,1)+LARGE(O7:O24,2)+LARGE(O7:O24,3)+LARGE(O7:O24,4)+LARGE(O7:O24,5)+LARGE(O7:O24,6)+LARGE(O7:O24,7)+LARGE(O7:O24,8)+LARGE(O7:O24,9)+LARGE(O7:O24,10)","v":111.29999999999998}]
[5,null,null,4,7.4,4,11.4,3,9.3000000000000007,3,12.3,3,9.25,3,12.25,4,8.9,4,12.9,6.5,null,6.5,8.3000000000000007,null,8.3000000000000007,"BF ",{"$f":"LARGE(S7:S24,1)+LARGE(S7:S24,2)+LARGE(S7:S24,3)+LARGE(S7:S24,4)+LARGE(S7:S24,5)+LARGE(S7:S24,6)+LARGE(S7:S24,7)+LARGE(S7:S24,8)+LARGE(S7:S24,9)+LARGE(S7:S24,10)","v":116.19999999999999}]
[6,null,null,4,9.3000000000000007,{"$f":"IF(OR(E12<7,NOT(ISNUMBER(D12))),\"\",IF(D12=0,\"\",CHOOSE(D12,1,2,3,4,5)))","v":4},{"$f":"SUM(E12:F12)","v":13.3},4,9.1,{"$f":"IF(OR(I12<7,NOT(ISNUMBER(H12))),\"\",IF(H12=0,\"\",CHOOSE(H12,1,2,3,4,5)))","v":4},{"$f":"SUM(I12:J12)","v":13.1},3,9.6,{"$f":"IF(OR(M12<7,NOT(ISNUMBER(L12))),\"\",IF(L12=0,\"\",CHOOSE(L12,1,2,3,4,5)))","v":3},{"$f":"SUM(M12:N12)","v":12.6},4,9.1999999999999993,{"$f":"IF(OR(Q12<7,NOT(ISNUMBER(P12))),\"\",IF(P12=0,\"\",CHOOSE(P12,1,2,3,4,5)))","v":4},{"$f":"SUM(Q12:R12)","v":13.2},7.6,null,{"$f":"SUM(T12:U12)","v":7.6},7.4,null,{"$f":"SUM(W12:X12)","v":7.4},"Arcons",{"$f":"LARGE(V7:V24,1)+LARGE(V7:V24,2)+LARGE(V7:V24,3)+LARGE(V7:V24,4)+LARGE(V7:V24,5)+LARGE(V7:V24,6)+LARGE(V7:V24,7)+LARGE(V7:V24,8)+LARGE(V7:V24,9)+LARGE(V7:V24,10)","v":54.6}]
[7,null,null,3,7.8,3,10.8,3,9.1,3,12.1,2,8.35,2,10.35,2,8.65,2,10.65,3.85,null,3.85,3.8,null,3.8,"Anneaux ",{"$f":"LARGE(Y7:Y24,1)+LARGE(Y7:Y24,2)+LARGE(Y7:Y24,3)+LARGE(Y7:Y24,4)+LARGE(Y7:Y24,5)+LARGE(Y7:Y24,6)+LARGE(Y7:Y24,7)+LARGE(Y7:Y24,8)+LARGE(Y7:Y24,9)+LARGE(Y7:Y24,10)","v":72}]
[8,null,null,3,8.8000000000000007,3,11.8,3,9.6,3,12.6,3,7.85,3,10.85,3,9.1,3,12.1,5.4,null,5.4,8.35,null,8.35]
[9,null,null,3,8.85,3,11.85,3,8.75,3,11.75,3,9.1999999999999993,3,12.2,3,9.4,3,12.4,6.45,null,6.45,8.35,null,8.35]
{"$rows_left_out":65}
{"sheet":"Challenge ","index":4,"n_rows":157,"n_cols":27,"rows_kept":157,"cut":false,"hidden":false,"merged":[]}
["JP1","JEANNE ARC "]
[null,"MOUVAUX "]
[1,"Nom ","Prénom","Degré ","Note ",null,"Sol ","Degré ","Note ",null,"Saut ","Degré ","Note ",null,"BP ","Degré ","Note ",null,"BF","Note ",null,"Arçons","Note ",null,"AN ","Total; des  3 notes "]
[null,null,null,3,7.4,{"$f":"IF(OR(E4<7,NOT(ISNUMBER(D4))),\"\",IF(D4=0,\"\",CHOOSE(D4,1,2,3,4,5)))","v":3},{"$f":"SUM(E4:F4)","v":10.4},3,8.1999999999999993,{"$f":"IF(OR(I4<7,NOT(ISNUMBER(H4))),\"\",IF(H4=0,\"\",CHOOSE(H4,1,2,3,4,5)))","v":3},{"$f":"SUM(I4:J4)","v":11.2},3,7.8,{"$f":"IF(OR(M4<7,NOT(ISNUMBER(L4))),\"\",IF(L4=0,\"\",CHOOSE(L4,1,2,3,4,5)))","v":3},{"$f":"SUM(M4:N4)","v":10.8},2,8.6,{"$f":"IF(OR(Q4<7,NOT(ISNUMBER(P4))),\"\",IF(P4=0,\"\",CHOOSE(P4,1,2,3,4,5)))","v":2},{"$f":"SUM(Q4:R4)","v":10.6},3.9,{"$f":"IF(OR(T4<7,NOT(ISNUMBER(#REF!))),\"\",IF(#REF!=0,\"\",CHOOSE(#REF!,1,2,3,4,5)))","v":""},{"$f":"SUM(T4:U4)","v":3.9},4.9000000000000004,{"$f":"IF(OR(W4<7,NOT(ISNUMBER(#REF!))),\"\",IF(#REF!=0,\"\",CHOOSE(#REF!,1,2,3,4,5)))","v":""},{"$f":"SUM(W4:X4)","v":4.9000000000000004}]
[null,null,null,3,6.05,{"$f":"IF(OR(E5<7,NOT(ISNUMBER(D5))),\"\",IF(D5=0,\"\",CHOOSE(D5,1,2,3,4,5)))","v":""},{"$f":"SUM(E5:F5)","v":6.05},2,8.3000000000000007,{"$f":"IF(OR(I5<7,NOT(ISNUMBER(H5))),\"\",IF(H5=0,\"\",CHOOSE(H5,1,2,3,4,5)))","v":2},{"$f":"SUM(I5:J5)","v":10.3},3,7.95,{"$f":"IF(OR(M5<7,NOT(ISNUMBER(L5))),\"\",IF(L5=0,\"\",CHOOSE(L5,1,2,3,4,5)))","v":3},{"$f":"SUM(M5:N5)","v":10.95},2,8.8000000000000007,{"$f":"IF(OR(Q5<7,NOT(ISNUMBER(P5))),\"\",IF(P5=0,\"\",CHOOSE(P5,1,2,3,4,5)))","v":2},{"$f":"SUM(Q5:R5)","v":10.8},2.5,{"$f":"IF(OR(T5<7,NOT(ISNUMBER(#REF!))),\"\",IF(#REF!=0,\"\",CHOOSE(#REF!,1,2,3,4,5)))","v":""},{"$f":"SUM(T5:U5)","v":2.5},7.65,{"$f":"IF(OR(W5<7,NOT(ISNUMBER(#REF!))),\"\",IF(#REF!=0,\"\",CHOOSE(#REF!,1,2,3,4,5)))","v":""},{"$f":"SUM(W5:X5)","v":7.65},"Sol",{"$f":"LARGE(G4:G21,1)+LARGE(G4:G21,2)+LARGE(G4:G21,3)","v":35.9}]
[null,null,null,1,8.65,{"$f":"IF(OR(E6<7,NOT(ISNUMBER(D6))),\"\",IF(D6=0,\"\",CHOOSE(D6,1,2,3,4,5)))","v":1},9.65,2,8.4499999999999993,2,10.45,1,8.8000000000000007,1,9.8000000000000007,2,7.25,2,9.25,2.6,{"$f":"IF(OR(T6<7,NOT(ISNUMBER(#REF!))),\"\",IF(#REF!=0,\"\",CHOOSE(#REF!,1,2,3,4,5)))","v":""},{"$f":"SUM(T6:U6)","v":2.6},2.8,{"$f":"IF(OR(W6<7,NOT(ISNUMBER(#REF!))),\"\",IF(#REF!=0,\"\",CHOOSE(#REF!,1,2,3,4,5)))","v":""},2.8,"Saut ",{"$f":"LARGE(K4:K21,1)+LARGE(K4:K21,2)+LARGE(K4:K21,3)","v":36.099999999999994}]
[null,null,null,2,5.85,"",5.85,2,8.5500000000000007,2,10.55,2,8.8000000000000007,2,10.8,2,8.85,2,10.85,1.85,{"$f":"IF(OR(T7<7,NOT(ISNUMBER(#REF!))),\"\",IF(#REF!=0,\"\",CHOOSE(#REF!,1,2,3,4,5)))","v":""},1.85,3.35,{"$f":"IF(OR(W7<7,NOT(ISNUMBER(#REF!))),\"\",IF(#REF!=0,\"\",CHOOSE(#REF!,1,2,3,4,5)))","v":""},3.35,"BP ",{"$f":"LARGE(O4:O21,1)+LARGE(O4:O21,2)+LARGE(O4:O21,3)","v":36.699999999999996}]
[null,null,null,2,8.1,2,{"$f":"SUM(E8:F8)","v":10.1},2,8.1,2,10.1,2,7.3,2,9.3000000000000007,2,7.3,2,9.3000000000000007,3.7,{"$f":"IF(OR(T8<7,NOT(ISNUMBER(#REF!))),\"\",IF(#REF!=0,\"\",CHOOSE(#REF!,1,2,3,4,5)))","v":""},3.7,1.1499999999999999,{"$f":"IF(OR(W8<7,NOT(ISNUMBER(#REF!))),\"\",IF(#REF!=0,\"\",CHOOSE(#REF!,1,2,3,4,5)))","v":""},1.1499999999999999,"BF ",{"$f":"LARGE(S4:S21,1)+LARGE(S4:S21,2)+LARGE(S4:S21,3)","v":35.35}]
[null,null,null,4,7.4,4,11.4,3,7.75,3,10.75,3,9.1999999999999993,3,12.2,3,8.75,3,11.75,3.5,{"$f":"IF(OR(T9<7,NOT(ISNUMBER(#REF!))),\"\",IF(#REF!=0,\"\",CHOOSE(#REF!,1,2,3,4,5)))","v":""},3.5,6.45,{"$f":"IF(OR(W9<7,NOT(ISNUMBER(#REF!))),\"\",IF(#REF!=0,\"\",CHOOSE(#REF!,1,2,3,4,5)))","v":""},6.45,"Arcons",{"$f":"LARGE(V4:V21,1)+LARGE(V4:V21,2)+LARGE(V4:V21,3)","v":16.099999999999998}]
[null,null,null,4,8.4,4,12.4,3,9.4499999999999993,3,12.45,4,9.35,4,13.35,3,9,3,12,7.1,{"$f":"IF(OR(T10<7,NOT(ISNUMBER(#REF!))),\"\",IF(#REF!=0,\"\",CHOOSE(#REF!,1,2,3,4,5)))","v":""},7.1,8.25,{"$f":"IF(OR(W10<7,NOT(ISNUMBER(#REF!))),\"\",IF(#REF!=0,\"\",CHOOSE(#REF!,1,2,3,4,5)))","v":""},8.25,"Anneaux ",{"$f":"LARGE(Y4:Y21,1)+LARGE(Y4:Y21,2)+LARGE(Y4:Y21,3)","v":22.35}]
[null,null,null,2,7.35,2,9.35,2,7,2,9,2,9.15,2,11.15,2,6.7,"",6.7,2.7,{"$f":"IF(OR(T11<7,NOT(ISNUMBER(#REF!))),\"\",IF(#REF!=0,\"\",CHOOSE(#REF!,1,2,3,4,5)))","v":""},2.7,1.8,{"$f":"IF(OR(W11<7,NOT(ISNUMBER(#REF!))),\"\",IF(#REF!=0,\"\",CHOOSE(#REF!,1,2,3,4,5)))","v":""},1.8]
[null,null,null,2,6.9,"",6.9,2,5,"",5,1,7.8,1,8.8000000000000007,2,6.8,"",6.8,1,{"$f":"IF(OR(T12<7,NOT(ISNUMBER(#REF!))),\"\",IF(#REF!=0,\"\",CHOOSE(#REF!,1,2,3,4,5)))","v":""},1,2.15,{"$f":"IF(OR(W12<7,NOT(ISNUMBER(#REF!))),\"\",IF(#REF!=0,\"\",CHOOSE(#REF!,1,2,3,4,5)))","v":""},2.15]
[null,null,null,2,8.1999999999999993,2,10.199999999999999,2,5,"",5,2,7.75,2,9.75,2,6.65,"",6.65,1,{"$f":"IF(OR(T13<7,NOT(ISNUMBER(#REF!))),\"\",IF(#REF!=0,\"\",CHOOSE(#REF!,1,2,3,4,5)))","v":""},1,1.3,{"$f":"IF(OR(W13<7,NOT(ISNUMBER(#REF!))),\"\",IF(#REF!=0,\"\",CHOOSE(#REF!,1,2,3,4,5)))","v":""},1.3]
[null,null,null,4,8.1,4,12.1,3,9.4499999999999993,3,12.45,2,7.25,2,9.25,3,8.6,3,11.6,5.0999999999999996,{"$f":"IF(OR(T14<7,NOT(ISNUMBER(#REF!))),\"\",IF(#REF!=0,\"\",CHOOSE(#REF!,1,2,3,4,5)))","v":""},5.0999999999999996,5.4,{"$f":"IF(OR(W14<7,NOT(ISNUMBER(#REF!))),\"\",IF(#REF!=0,\"\",CHOOSE(#REF!,1,2,3,4,5)))","v":""},5.4]
[null,null,null,null,null,"",0,null,null,"",0,null,null,"",0,null,null,"",0,null,{"$f":"IF(OR(T15<7,NOT(ISNUMBER(#REF!))),\"\",IF(#REF!=0,\"\",CHOOSE(#REF!,1,2,3,4,5)))","v":""},0,null,{"$f":"IF(OR(W15<7,NOT(ISNUMBER(#REF!))),\"\",IF(#REF!=0,\"\",CHOOSE(#REF!,1,2,3,4,5)))","v":""},0]
{"$rows_left_out":143}
{"sheet":"total ","index":5,"n_rows":25,"n_cols":4,"rows_kept":25,"cut":false,"hidden":false,"merged":[]}
[]
["Nombre EQUIPES REGIONAL POUSSINS"]
[]
["Club ","Poussins R1","Poussins R2","Poussins R3"]
[]
["ARMENTIERES ",1]
["BAILLEUL ",1]
["CYSOING"]
["DUNKERQUE"]
["ESTAIRES ",null,null,1]
["FOURNES EN WEPPES",null,1]
["HEM"]
["LAMBRES LEZ DOUAI"]
["MARQUILLIES"]
["MOUVAUX ",1]
{"$rows_left_out":11}
{"sheet":"juges","index":6,"n_rows":4,"n_cols":1,"rows_kept":4,"cut":false,"hidden":true,"merged":[]}
[]
[]
[]
["JUGES MANQUANTS"]